Compiz Fusion - Super Compiz



Re: Compiz Fusion

Postby cowboy » Tue Jan 08, 2008 10:06 pm

Here is the Compiz Forum.. http://forum.compiz-fusion.org/ will come back with some more info.
And here..viewtopic.php?p=1976&sid=e15d072b22da5f46332b8bb8c5c41870#p1976

This should get you started ;)
Attachments
Screenshot.png
"Back up your Data"
"May I never lose the view of a nubie"
"Give a man a fish, he will eat for a day, teach a man how to fish , he will eat a lifetime"
Asus P8Z68-V PRO/GEN3
i5 2500k
3x4G-Skill Ripjaws
MSI GTX 560Ti Hawk..
Seagate 1TB Barracuda
NZXT 850w PS
CM Storm Sniper Case
Evga Superclock CPU Cooler
Mushkin SSD coming soon
http://acowboydave.blogspot.com/
User avatar
cowboy
U.E. God
U.E. God
 
Posts: 2625
Joined: Mon Oct 15, 2007 2:38 pm
Location: Scottsdale Az
Age: 65
Operating System: Ultimate Edition 3.2 64 BIT



Re: Compiz Fusion

Postby tranz » Thu Jan 10, 2008 1:56 am

kiwinsn wrote:Is there anywhere (or anyone) that can give a complete noob step by step instructions on setting Compiz-Fusion up so I get the rotating cube,especially what triggers the cube to spin, as well as the other effects like flames or wobbles or naked girls (maybe?) when windows close?

Cheers
:D OH MAN That is too funny!!! :lol: I second that MAHN! You think you could add a naked girl option to the Prefrences? HA HA HA HA! She could WOBBLY Her A@$ while dodging amarok!!! Kiwinsn you keep up the great suggestions! ;)
User avatar
tranz
U.E. Knowledgable
U.E. Knowledgable
 
Posts: 40
Joined: Mon Oct 29, 2007 2:59 am
Location: America
Operating System: Ultimate Edition 3.4 64 BIT



Re: Compiz Fusion

Postby TheeMahn » Tue Jan 15, 2008 2:13 pm

tranz wrote:
kiwinsn wrote:Is there anywhere (or anyone) that can give a complete noob step by step instructions on setting Compiz-Fusion up so I get the rotating cube,especially what triggers the cube to spin, as well as the other effects like flames or wobbles or naked girls (maybe?) when windows close?

Cheers
:D OH MAN That is too funny!!! :lol: I second that MAHN! You think you could add a naked girl option to the Prefrences? HA HA HA HA! She could WOBBLY Her A@$ while dodging amarok!!! Kiwinsn you keep up the great suggestions! ;)



Should I write a plugin? Time I do not have on my side, I am fighting a losing battle pretending to win. Perhaps as Ozzy says, I am too a secret loser. I have thought of writing a plugin to make windows move with the music after a period of time hook screensaver function and engage the mode compiz is totally bad, I am sure you will see better then I refer to. As for kiwinsn ctrl & alt hold down left click and spin.
Home of Ultimate Edition. Got a question? Please review the F.A.Q. Browse the How to section.

Main O/S: Builder of O/S Guess.
Mainboard: ASUS Hero VI (AM4)
CPU: AMD 1700X water cooled (Deepcool Captain Genome Cooling tower)
Ram: 16 GB GSkill Trident RGB Series Dual Channel DDR4 3200
Video: MSI RX470 8GB Gaming card.
Hard Disks: MASSIVE on the network.(10 Gigabit, 48 port, multiple servers)
Monitors: 4K Samsung 28", HannsG HH281, Various others
750 Watt modular PSU (Rosswell)
1100 Watt Amp & 4 X 600 Watt speakers

Servers in the basement.
User avatar
TheeMahn
Site Admin
 
Posts: 4199
Joined: Fri Oct 12, 2007 10:02 am
Location: U.S.A.
Age: 47
Operating System: Ultimate Edition Developer



Re: Compiz Fusion

Postby Zero Prime » Sun Feb 03, 2008 7:38 pm

Anyone know what an error 126 is? That's what I'm now getting when trying to install these packages in 1.7.
Badges? We don't need no stinking badges!
Windows 7 64bit / Ultimate Edition 2.5
AMD Phenom 945 3.0Ghz Quad core
Foxconn A7GM-S AM2+/AM2 AMD 780G HDMI
HIS ATI 4670 1Gig
6GB DDR2 SDRAM DDR2 800
Seagate 250gig HD
Thermaltake Xaser V case
User avatar
Zero Prime
U.E. Master
U.E. Master
 
Posts: 585
Joined: Wed Oct 17, 2007 2:12 pm
Location: Sumter, SC
Age: 42
Operating System: Ultimate Edition 3.2 64 BIT



Re: Compiz Fusion

Postby TheeMahn » Thu Feb 07, 2008 10:14 am

Zero Prime wrote:Anyone know what an error 126 is? That's what I'm now getting when trying to install these packages in 1.7.



Make sure you have all repos enabled below is a shot that most forget to check.
Attachments
Screenshot-2.png
Backports
Home of Ultimate Edition. Got a question? Please review the F.A.Q. Browse the How to section.

Main O/S: Builder of O/S Guess.
Mainboard: ASUS Hero VI (AM4)
CPU: AMD 1700X water cooled (Deepcool Captain Genome Cooling tower)
Ram: 16 GB GSkill Trident RGB Series Dual Channel DDR4 3200
Video: MSI RX470 8GB Gaming card.
Hard Disks: MASSIVE on the network.(10 Gigabit, 48 port, multiple servers)
Monitors: 4K Samsung 28", HannsG HH281, Various others
750 Watt modular PSU (Rosswell)
1100 Watt Amp & 4 X 600 Watt speakers

Servers in the basement.
User avatar
TheeMahn
Site Admin
 
Posts: 4199
Joined: Fri Oct 12, 2007 10:02 am
Location: U.S.A.
Age: 47
Operating System: Ultimate Edition Developer



Re: Compiz Fusion

Postby Zero Prime » Thu Feb 07, 2008 6:29 pm

Thanks. I forgot all about the repos. Now if only the screen saver would work for me.
Badges? We don't need no stinking badges!
Windows 7 64bit / Ultimate Edition 2.5
AMD Phenom 945 3.0Ghz Quad core
Foxconn A7GM-S AM2+/AM2 AMD 780G HDMI
HIS ATI 4670 1Gig
6GB DDR2 SDRAM DDR2 800
Seagate 250gig HD
Thermaltake Xaser V case
User avatar
Zero Prime
U.E. Master
U.E. Master
 
Posts: 585
Joined: Wed Oct 17, 2007 2:12 pm
Location: Sumter, SC
Age: 42
Operating System: Ultimate Edition 3.2 64 BIT



Re: Compiz Fusion - Super Compiz

Postby painterh » Tue May 06, 2008 10:58 am

Hello;
Maybe I'll be the first to mention it, or maybe I was the only one stupid enough to try it, but the extra eye candy for super compiz will not work on 1.8 64. I made the mistake of installing as per instructions on first page of this topic. It seems to created major problems with Compiz. How can I remove just what was added during this install? Many of the settings for Compiz will not work now, including the desktop cube and many of the other settings wont even stay checked when I try to enable them. In addition, the extras I was hope to get, don't even show up in Compiz settings manager. It has created major problems with my desktop, nvidia drivers and settings, and the desktop doesn't load properly (icons in upper panel anre out of place and wont return to normal position). It also seems to have done something to the way avant window manager shows up on desktop. After configuring it to show my most used programs, after installing the eye candy upgrades it now lists two of every icon that was supposed to be there. I just want to reverse what happened from installing that eye candy, and remove it. Help Please!
There are 3 things that happen when you start getting old. The first is your memory starts to go and I can't remember the other 2. Wait! What was I talking about?

My system:
Asus A8n-sli Deluxe MB
Opteron 170 OC'd to 2.8ghz
1 gig ram
2 160 gig Seagate sata 7200 Barracuda drives
Writemaster Dvd burner with lightscribe
Nvidia 7600GS graphics card
Dual boot; Ultimate 1.8 x64 (95% time) & Win XP Home (only for college course work)
User avatar
painterh
U.E. Graduate
U.E. Graduate
 
Posts: 92
Joined: Sun Oct 21, 2007 11:54 am
Location: Pasco, WA US
Age: 66
Operating System: Ultimate Edition 3.0 Lite



SOLVED-Compiz Fusion - Super Compiz -

Postby painterh » Wed May 07, 2008 4:30 pm

Well, It seems to have straightened up after I removed all Compiz and Compiz-fusion components using Synaptic and re-installing them. I'm not sure if it helped any but I ran apt-get 'autoremove' between removing Compiz and re-installing. The only issue that remains is that the placement of some of panel icons for currently running programs has moved into the center of the top panel instead of on the right, and I haven't figured out how to move it back to the right next to time and date.
I'm not going to let that irritate me too much because everything works as it's supposed to. So far, I'm a big fan of 1.8 64bit. I think it is faster than my previous install of 1.7 32bit. Cheers
There are 3 things that happen when you start getting old. The first is your memory starts to go and I can't remember the other 2. Wait! What was I talking about?

My system:
Asus A8n-sli Deluxe MB
Opteron 170 OC'd to 2.8ghz
1 gig ram
2 160 gig Seagate sata 7200 Barracuda drives
Writemaster Dvd burner with lightscribe
Nvidia 7600GS graphics card
Dual boot; Ultimate 1.8 x64 (95% time) & Win XP Home (only for college course work)
User avatar
painterh
U.E. Graduate
U.E. Graduate
 
Posts: 92
Joined: Sun Oct 21, 2007 11:54 am
Location: Pasco, WA US
Age: 66
Operating System: Ultimate Edition 3.0 Lite



Re: Compiz Fusion - Super Compiz

Postby jfg69 » Sun May 11, 2008 2:06 am

LOL, Something has apparently gone wrong... oddly enough after all the errors, it says operation successful! Upon uninstalling to re-install, I apparently got rid of something that I needed. Just what that WAS I have no clue!
My CF only partially works.. when I use the compiz window mgr I dont have any bars on my windows. When I switch it to metacity, I get them, but then compiz does diddly-do. I also had to re-install NV drivers via Envy.
Good thing I have nothing better to do ;)




Code: Select all
tile.c:1095: warning: control reaches end of non-void function
tile.c: At top level:
tile.c:1099: error: expected declaration specifiers or '...' before 'CompAction'
tile.c:1100: error: expected declaration specifiers or '...' before 'CompActionState'
tile.c: In function 'tileToggle':
tile.c:1108: warning: assignment makes pointer from integer without a cast
tile.c:1114: error: dereferencing pointer to incomplete type
tile.c:1114: error: dereferencing pointer to incomplete type
tile.c:1116: error: dereferencing pointer to incomplete type
tile.c:1116: error: dereferencing pointer to incomplete type
tile.c:1118: error: dereferencing pointer to incomplete type
tile.c:1118: error: dereferencing pointer to incomplete type
tile.c:1118: error: dereferencing pointer to incomplete type
tile.c:1135: error: 'FALSE' undeclared (first use in this function)
tile.c:1136: warning: control reaches end of non-void function
tile.c: In function 'tileInitDisplay':
tile.c:1147: warning: implicit declaration of function 'allocateScreenPrivateIndex'
tile.c:1147: warning: nested extern declaration of 'allocateScreenPrivateIndex'
tile.c:1153: error: 'FALSE' undeclared (first use in this function)
tile.c:1156: error: too many arguments to function 'tileSetTileVerticallyInitiate'
tile.c:1157: error: too many arguments to function 'tileSetTileHorizontallyInitiate'
tile.c:1158: error: too many arguments to function 'tileSetTileTileInitiate'
tile.c:1159: error: too many arguments to function 'tileSetTileCascadeInitiate'
tile.c:1160: error: too many arguments to function 'tileSetTileRestoreInitiate'
tile.c:1161: error: too many arguments to function 'tileSetTileToggleInitiate'
tile.c:1164: error: dereferencing pointer to incomplete type
tile.c:1166: error: 'TRUE' undeclared (first use in this function)
tile.c:1167: warning: control reaches end of non-void function
tile.c: In function 'tileFiniDisplay':
tile.c:1173: error: dereferencing pointer to incomplete type
tile.c:1176: warning: implicit declaration of function 'freeScreenPrivateIndex'
tile.c:1176: warning: nested extern declaration of 'freeScreenPrivateIndex'
tile.c: In function 'tileInitWindow':
tile.c:1187: error: dereferencing pointer to incomplete type
tile.c:1187: error: dereferencing pointer to incomplete type
tile.c:1191: error: 'FALSE' undeclared (first use in this function)
tile.c:1204: error: 'TileWindow' has no member named 'outlineColor'
tile.c:1205: error: 'TileWindow' has no member named 'outlineColor'
tile.c:1206: error: 'TileWindow' has no member named 'outlineColor'
tile.c:1208: error: dereferencing pointer to incomplete type
tile.c:1210: error: 'TRUE' undeclared (first use in this function)
tile.c:1211: warning: control reaches end of non-void function
tile.c: In function 'tileFiniWindow':
tile.c:1217: error: dereferencing pointer to incomplete type
tile.c:1217: error: dereferencing pointer to incomplete type
tile.c:1217: error: dereferencing pointer to incomplete type
tile.c: In function 'tileInit':
tile.c:1225: warning: implicit declaration of function 'allocateDisplayPrivateIndex'
tile.c:1225: warning: nested extern declaration of 'allocateDisplayPrivateIndex'
tile.c:1228: error: 'FALSE' undeclared (first use in this function)
tile.c:1230: error: 'TRUE' undeclared (first use in this function)
tile.c:1231: warning: control reaches end of non-void function
tile.c: In function 'tileFini':
tile.c:1236: warning: implicit declaration of function 'freeDisplayPrivateIndex'
tile.c:1236: warning: nested extern declaration of 'freeDisplayPrivateIndex'
tile.c: In function 'tileGetVersion':
tile.c:1243: error: 'ABIVERSION' undeclared (first use in this function)
tile.c:1244: warning: control reaches end of non-void function
tile.c: At top level:
tile.c:1246: error: expected '=', ',', ';', 'asm' or '__attribute__' before 'tileVTable'
tile.c:1264: error: expected '=', ',', ';', 'asm' or '__attribute__' before '*' token
make: *** [build/tile.lo] Error 1
compiling : tile.c -> build/tile.loIn file included from tile.c:38:
build/tile_options.h:19: error: expected '=', ',', ';', 'asm' or '__attribute__' before '*' token
build/tile_options.h:95: error: expected '=', ',', ';', 'asm' or '__attribute__' before '*' token
build/tile_options.h:99: error: expected '=', ',', ';', 'asm' or '__attribute__' before '*' token
build/tile_options.h:100: error: expected declaration specifiers or '...' before 'CompActionCallBackProc'
build/tile_options.h:101: error: expected declaration specifiers or '...' before 'CompActionCallBackProc'
build/tile_options.h:105: error: expected '=', ',', ';', 'asm' or '__attribute__' before '*' token
build/tile_options.h:106: error: expected declaration specifiers or '...' before 'CompActionCallBackProc'
build/tile_options.h:107: error: expected declaration specifiers or '...' before 'CompActionCallBackProc'
build/tile_options.h:111: error: expected '=', ',', ';', 'asm' or '__attribute__' before '*' token
build/tile_options.h:112: error: expected declaration specifiers or '...' before 'CompActionCallBackProc'
build/tile_options.h:113: error: expected declaration specifiers or '...' before 'CompActionCallBackProc'
build/tile_options.h:117: error: expected '=', ',', ';', 'asm' or '__attribute__' before '*' token
build/tile_options.h:118: error: expected declaration specifiers or '...' before 'CompActionCallBackProc'
build/tile_options.h:119: error: expected declaration specifiers or '...' before 'CompActionCallBackProc'
build/tile_options.h:123: error: expected '=', ',', ';', 'asm' or '__attribute__' before '*' token
build/tile_options.h:124: error: expected declaration specifiers or '...' before 'CompActionCallBackProc'
build/tile_options.h:125: error: expected declaration specifiers or '...' before 'CompActionCallBackProc'
build/tile_options.h:129: error: expected '=', ',', ';', 'asm' or '__attribute__' before '*' token
build/tile_options.h:130: error: expected declaration specifiers or '...' before 'CompActionCallBackProc'
build/tile_options.h:131: error: expected declaration specifiers or '...' before 'CompActionCallBackProc'
tile.c:61: error: expected specifier-qualifier-list before 'PaintWindowProc'
tile.c:84: error: expected specifier-qualifier-list before 'GLushort'
tile.c:110: warning: type defaults to 'int' in declaration of 'WindowPaintAttrib'
tile.c:110: error: expected ';', ',' or ')' before '*' token
tile.c: In function 'tilePreparePaintScreen':
tile.c:242: error: dereferencing pointer to incomplete type
tile.c:242: error: dereferencing pointer to incomplete type
tile.c:248: warning: implicit declaration of function 'UNWRAP'
tile.c:248: warning: nested extern declaration of 'UNWRAP'
tile.c:248: error: 'preparePaintScreen' undeclared (first use in this function)
tile.c:248: error: (Each undeclared identifier is reported only once
tile.c:248: error: for each function it appears in.)
tile.c:249: error: dereferencing pointer to incomplete type
tile.c:250: warning: implicit declaration of function 'WRAP'
tile.c:250: warning: nested extern declaration of 'WRAP'
tile.c: At top level:
tile.c:255: error: expected declaration specifiers or '...' before 'CompOutput'
tile.c: In function 'tilePaintScreen':
tile.c:259: error: dereferencing pointer to incomplete type
tile.c:259: error: dereferencing pointer to incomplete type
tile.c:263: error: 'outputs' undeclared (first use in this function)
tile.c:263: error: dereferencing pointer to incomplete type
tile.c:267: error: 'paintScreen' undeclared (first use in this function)
tile.c:268: error: dereferencing pointer to incomplete type
tile.c: In function 'tileDonePaintScreen':
tile.c:275: error: dereferencing pointer to incomplete type
tile.c:275: error: dereferencing pointer to incomplete type
tile.c:279: error: dereferencing pointer to incomplete type
tile.c:282: error: dereferencing pointer to incomplete type
tile.c:282: error: dereferencing pointer to incomplete type
tile.c:284: error: dereferencing pointer to incomplete type
tile.c:284: error: dereferencing pointer to incomplete type
tile.c:284: error: dereferencing pointer to incomplete type
tile.c:290: warning: implicit declaration of function 'removeScreenGrab'
tile.c:290: warning: nested extern declaration of 'removeScreenGrab'
tile.c:294: warning: implicit declaration of function 'damageScreen'
tile.c:294: warning: nested extern declaration of 'damageScreen'
tile.c:297: error: 'donePaintScreen' undeclared (first use in this function)
tile.c:298: error: dereferencing pointer to incomplete type
tile.c: At top level:
tile.c:304: warning: type defaults to 'int' in declaration of 'ScreenPaintAttrib'
tile.c:304: error: expected ';', ',' or ')' before '*' token
tile.c: In function 'tileResizeNotify':
tile.c:396: error: dereferencing pointer to incomplete type
tile.c:396: error: dereferencing pointer to incomplete type
tile.c:397: error: dereferencing pointer to incomplete type
tile.c:397: error: dereferencing pointer to incomplete type
tile.c:397: error: dereferencing pointer to incomplete type
tile.c:399: error: dereferencing pointer to incomplete type
tile.c:399: error: 'windowResizeNotify' undeclared (first use in this function)
tile.c:400: error: dereferencing pointer to incomplete type
tile.c:401: error: dereferencing pointer to incomplete type
tile.c:405: error: 'TRUE' undeclared (first use in this function)
tile.c:410: error: dereferencing pointer to incomplete type
tile.c:413: error: 'FALSE' undeclared (first use in this function)
tile.c:416: error: dereferencing pointer to incomplete type
tile.c:416: error: dereferencing pointer to incomplete type
tile.c:437: error: dereferencing pointer to incomplete type
tile.c:437: error: dereferencing pointer to incomplete type
tile.c:438: error: dereferencing pointer to incomplete type
tile.c:438: error: dereferencing pointer to incomplete type
tile.c:439: error: dereferencing pointer to incomplete type
tile.c:439: error: dereferencing pointer to incomplete type
tile.c:440: error: dereferencing pointer to incomplete type
tile.c:445: error: dereferencing pointer to incomplete type
tile.c:445: error: dereferencing pointer to incomplete type
tile.c:446: error: dereferencing pointer to incomplete type
tile.c:446: error: dereferencing pointer to incomplete type
tile.c:447: error: dereferencing pointer to incomplete type
tile.c:448: error: dereferencing pointer to incomplete type
tile.c:448: error: dereferencing pointer to incomplete type
tile.c:449: error: dereferencing pointer to incomplete type
tile.c:456: error: dereferencing pointer to incomplete type
tile.c:456: error: dereferencing pointer to incomplete type
tile.c:457: error: dereferencing pointer to incomplete type
tile.c:458: error: dereferencing pointer to incomplete type
tile.c:458: error: dereferencing pointer to incomplete type
tile.c:459: error: dereferencing pointer to incomplete type
tile.c:459: error: dereferencing pointer to incomplete type
tile.c:464: error: dereferencing pointer to incomplete type
tile.c:464: error: dereferencing pointer to incomplete type
tile.c:465: error: dereferencing pointer to incomplete type
tile.c:465: error: dereferencing pointer to incomplete type
tile.c:466: error: dereferencing pointer to incomplete type
tile.c:467: error: dereferencing pointer to incomplete type
tile.c:468: error: dereferencing pointer to incomplete type
tile.c:468: error: dereferencing pointer to incomplete type
tile.c:477: error: dereferencing pointer to incomplete type
tile.c:479: error: dereferencing pointer to incomplete type
tile.c:479: error: dereferencing pointer to incomplete type
tile.c:481: error: dereferencing pointer to incomplete type
tile.c:481: error: dereferencing pointer to incomplete type
tile.c:481: error: dereferencing pointer to incomplete type
tile.c:483: error: dereferencing pointer to incomplete type
tile.c:483: error: dereferencing pointer to incomplete type
tile.c:486: error: dereferencing pointer to incomplete type
tile.c:487: error: dereferencing pointer to incomplete type
tile.c:487: error: dereferencing pointer to incomplete type
tile.c:487: error: dereferencing pointer to incomplete type
tile.c:489: error: dereferencing pointer to incomplete type
tile.c:490: error: dereferencing pointer to incomplete type
tile.c:491: error: dereferencing pointer to incomplete type
tile.c:499: error: dereferencing pointer to incomplete type
tile.c:501: error: dereferencing pointer to incomplete type
tile.c:501: error: dereferencing pointer to incomplete type
tile.c:503: error: dereferencing pointer to incomplete type
tile.c:503: error: dereferencing pointer to incomplete type
tile.c:503: error: dereferencing pointer to incomplete type
tile.c:505: error: dereferencing pointer to incomplete type
tile.c:505: error: dereferencing pointer to incomplete type
tile.c:511: error: dereferencing pointer to incomplete type
tile.c:511: error: dereferencing pointer to incomplete type
tile.c:512: error: dereferencing pointer to incomplete type
tile.c:512: error: dereferencing pointer to incomplete type
tile.c:513: error: dereferencing pointer to incomplete type
tile.c:513: error: dereferencing pointer to incomplete type
tile.c:514: error: dereferencing pointer to incomplete type
tile.c:520: error: dereferencing pointer to incomplete type
tile.c:521: error: dereferencing pointer to incomplete type
tile.c:522: error: dereferencing pointer to incomplete type
tile.c:523: error: dereferencing pointer to incomplete type
tile.c:525: error: dereferencing pointer to incomplete type
tile.c:525: error: dereferencing pointer to incomplete type
tile.c:526: error: dereferencing pointer to incomplete type
tile.c:526: error: dereferencing pointer to incomplete type
tile.c:527: error: dereferencing pointer to incomplete type
tile.c:527: error: dereferencing pointer to incomplete type
tile.c:528: error: dereferencing pointer to incomplete type
tile.c:528: error: dereferencing pointer to incomplete type
tile.c:529: error: dereferencing pointer to incomplete type
tile.c:529: error: dereferencing pointer to incomplete type
tile.c:530: error: dereferencing pointer to incomplete type
tile.c:530: error: dereferencing pointer to incomplete type
tile.c:532: error: dereferencing pointer to incomplete type
tile.c:534: error: dereferencing pointer to incomplete type
tile.c:534: error: dereferencing pointer to incomplete type
tile.c: In function 'tileInitScreen':
tile.c:554: error: dereferencing pointer to incomplete type
tile.c:558: warning: implicit declaration of function 'allocateWindowPrivateIndex'
tile.c:558: warning: nested extern declaration of 'allocateWindowPrivateIndex'
tile.c:562: error: 'FALSE' undeclared (first use in this function)
tile.c:566: error: dereferencing pointer to incomplete type
tile.c:573: error: 'paintOutput' undeclared (first use in this function)
tile.c:573: error: 'tilePaintOutput' undeclared (first use in this function)
tile.c:574: error: 'preparePaintScreen' undeclared (first use in this function)
tile.c:575: error: 'paintScreen' undeclared (first use in this function)
tile.c:576: error: 'donePaintScreen' undeclared (first use in this function)
tile.c:577: error: 'windowResizeNotify' undeclared (first use in this function)
tile.c:578: error: 'paintWindow' undeclared (first use in this function)
tile.c:578: error: 'tilePaintWindow' undeclared (first use in this function)
tile.c:580: error: 'TRUE' undeclared (first use in this function)
tile.c:581: warning: control reaches end of non-void function
tile.c: In function 'tileFiniScreen':
tile.c:587: error: dereferencing pointer to incomplete type
tile.c:587: error: dereferencing pointer to incomplete type
tile.c:589: warning: implicit declaration of function 'freeWindowPrivateIndex'
tile.c:589: warning: nested extern declaration of 'freeWindowPrivateIndex'
tile.c:592: error: 'paintOutput' undeclared (first use in this function)
tile.c:593: error: 'preparePaintScreen' undeclared (first use in this function)
tile.c:594: error: 'paintScreen' undeclared (first use in this function)
tile.c:595: error: 'donePaintScreen' undeclared (first use in this function)
tile.c:596: error: 'windowResizeNotify' undeclared (first use in this function)
tile.c:597: error: 'paintWindow' undeclared (first use in this function)
tile.c: In function 'constrainMinMax':
tile.c:611: error: dereferencing pointer to incomplete type
tile.c:614: error: 'MAXSHORT' undeclared (first use in this function)
tile.c: In function 'placeWin':
tile.c:661: error: 'FALSE' undeclared (first use in this function)
tile.c:668: error: dereferencing pointer to incomplete type
tile.c:668: error: dereferencing pointer to incomplete type
tile.c:669: error: dereferencing pointer to incomplete type
tile.c:669: error: dereferencing pointer to incomplete type
tile.c:670: error: 'TRUE' undeclared (first use in this function)
tile.c:672: error: dereferencing pointer to incomplete type
tile.c:672: error: dereferencing pointer to incomplete type
tile.c:672: error: dereferencing pointer to incomplete type
tile.c:675: error: dereferencing pointer to incomplete type
tile.c:676: error: dereferencing pointer to incomplete type
tile.c:677: error: dereferencing pointer to incomplete type
tile.c:678: error: dereferencing pointer to incomplete type
tile.c:689: error: dereferencing pointer to incomplete type
tile.c:708: warning: control reaches end of non-void function
tile.c: In function 'tileSetNewWindowSize':
tile.c:715: error: dereferencing pointer to incomplete type
tile.c:715: error: dereferencing pointer to incomplete type
tile.c:715: error: dereferencing pointer to incomplete type
tile.c:716: error: dereferencing pointer to incomplete type
tile.c:716: error: dereferencing pointer to incomplete type
tile.c:726: warning: implicit declaration of function 'maximizeWindow'
tile.c:726: warning: nested extern declaration of 'maximizeWindow'
tile.c:731: warning: implicit declaration of function 'configureXWindow'
tile.c:731: warning: nested extern declaration of 'configureXWindow'
tile.c:732: error: 'FALSE' undeclared (first use in this function)
tile.c:734: error: 'TRUE' undeclared (first use in this function)
tile.c:735: warning: control reaches end of non-void function
tile.c: In function 'isTileWindow':
tile.c:742: warning: implicit declaration of function 'matchEval'
tile.c:742: warning: nested extern declaration of 'matchEval'
tile.c:742: warning: implicit declaration of function 'tileGetExcludeMatch'
tile.c:742: warning: nested extern declaration of 'tileGetExcludeMatch'
tile.c:742: error: dereferencing pointer to incomplete type
tile.c:743: error: 'FALSE' undeclared (first use in this function)
tile.c:745: error: dereferencing pointer to incomplete type
tile.c:748: error: dereferencing pointer to incomplete type
tile.c:751: error: dereferencing pointer to incomplete type
tile.c:751: error: 'CompWindowTypeDockMask' undeclared (first use in this function)
tile.c:751: error: 'CompWindowTypeDesktopMask' undeclared (first use in this function)
tile.c:754: error: dereferencing pointer to incomplete type
tile.c:754: error: 'CompWindowStateSkipPagerMask' undeclared (first use in this function)
tile.c:757: error: dereferencing pointer to incomplete type
tile.c:757: error: dereferencing pointer to incomplete type
tile.c:760: error: 'TRUE' undeclared (first use in this function)
tile.c:761: warning: control reaches end of non-void function
tile.c: In function 'saveCoords':
tile.c:767: error: dereferencing pointer to incomplete type
tile.c:767: error: dereferencing pointer to incomplete type
tile.c:767: error: dereferencing pointer to incomplete type
tile.c:772: error: dereferencing pointer to incomplete type
tile.c:773: error: dereferencing pointer to incomplete type
tile.c:774: error: dereferencing pointer to incomplete type
tile.c:775: error: dereferencing pointer to incomplete type
tile.c:777: error: dereferencing pointer to incomplete type
tile.c:777: error: 'MAXIMIZE_STATE' undeclared (first use in this function)
tile.c:779: error: 'TRUE' undeclared (first use in this function)
tile.c: In function 'applyTiling':
tile.c:789: error: dereferencing pointer to incomplete type
tile.c:789: error: dereferencing pointer to incomplete type
tile.c:792: error: 'FALSE' undeclared (first use in this function)
tile.c:794: error: dereferencing pointer to incomplete type
tile.c:794: error: dereferencing pointer to incomplete type
tile.c:800: error: dereferencing pointer to incomplete type
tile.c:800: warning: implicit declaration of function 'MAX'
tile.c:800: warning: nested extern declaration of 'MAX'
tile.c:809: error: 'TRUE' undeclared (first use in this function)
tile.c:812: error: 'CompWindowExtents' undeclared (first use in this function)
tile.c:812: error: expected ';' before 'border'
tile.c:814: error: 'border' undeclared (first use in this function)
tile.c:819: error: dereferencing pointer to incomplete type
tile.c:819: error: dereferencing pointer to incomplete type
tile.c:821: error: dereferencing pointer to incomplete type
tile.c:822: error: dereferencing pointer to incomplete type
tile.c:823: error: dereferencing pointer to incomplete type
tile.c:824: error: dereferencing pointer to incomplete type
tile.c:825: error: dereferencing pointer to incomplete type
tile.c:826: error: dereferencing pointer to incomplete type
tile.c:827: error: dereferencing pointer to incomplete type
tile.c:828: error: dereferencing pointer to incomplete type
tile.c:831: error: dereferencing pointer to incomplete type
tile.c:845: error: dereferencing pointer to incomplete type
tile.c:858: error: dereferencing pointer to incomplete type
tile.c:868: error: dereferencing pointer to incomplete type
tile.c:868: error: dereferencing pointer to incomplete type
tile.c:873: error: dereferencing pointer to incomplete type
tile.c:873: error: dereferencing pointer to incomplete type
tile.c:873: error: dereferencing pointer to incomplete type
tile.c:969: warning: implicit declaration of function 'pushScreenGrab'
tile.c:969: warning: nested extern declaration of 'pushScreenGrab'
tile.c:969: error: dereferencing pointer to incomplete type
tile.c:975: warning: control reaches end of non-void function
tile.c: At top level:
tile.c:979: error: expected declaration specifiers or '...' before 'CompAction'
tile.c:980: error: expected declaration specifiers or '...' before 'CompActionState'
tile.c: In function 'tileTile':
tile.c:987: warning: implicit declaration of function 'getIntOptionNamed'
tile.c:987: warning: nested extern declaration of 'getIntOptionNamed'
tile.c:988: warning: implicit declaration of function 'findScreenAtDisplay'
tile.c:988: warning: nested extern declaration of 'findScreenAtDisplay'
tile.c:988: warning: assignment makes pointer from integer without a cast
tile.c:992: error: dereferencing pointer to incomplete type
tile.c:992: error: dereferencing pointer to incomplete type
tile.c:998: error: 'FALSE' undeclared (first use in this function)
tile.c:999: warning: control reaches end of non-void function
tile.c: At top level:
tile.c:1003: error: expected declaration specifiers or '...' before 'CompAction'
tile.c:1004: error: expected declaration specifiers or '...' before 'CompActionState'
tile.c: In function 'tileVertically':
tile.c:1012: warning: assignment makes pointer from integer without a cast
tile.c:1016: error: dereferencing pointer to incomplete type
tile.c:1016: error: dereferencing pointer to incomplete type
tile.c:1022: error: 'FALSE' undeclared (first use in this function)
tile.c:1023: warning: control reaches end of non-void function
tile.c: At top level:
tile.c:1027: error: expected declaration specifiers or '...' before 'CompAction'
tile.c:1028: error: expected declaration specifiers or '...' before 'CompActionState'
tile.c: In function 'tileHorizontally':
tile.c:1036: warning: assignment makes pointer from integer without a cast
tile.c:1040: error: dereferencing pointer to incomplete type
tile.c:1040: error: dereferencing pointer to incomplete type
tile.c:1046: error: 'FALSE' undeclared (first use in this function)
tile.c:1047: warning: control reaches end of non-void function
tile.c: At top level:
tile.c:1051: error: expected declaration specifiers or '...' before 'CompAction'
tile.c:1052: error: expected declaration specifiers or '...' before 'CompActionState'
tile.c: In function 'tileCascade':
tile.c:1060: warning: assignment makes pointer from integer without a cast
tile.c:1064: error: dereferencing pointer to incomplete type
tile.c:1064: error: dereferencing pointer to incomplete type
tile.c:1070: error: 'FALSE' undeclared (first use in this function)
tile.c:1071: warning: control reaches end of non-void function
tile.c: At top level:
tile.c:1075: error: expected declaration specifiers or '...' before 'CompAction'
tile.c:1076: error: expected declaration specifiers or '...' before 'CompActionState'
tile.c: In function 'tileRestore':
tile.c:1084: warning: assignment makes pointer from integer without a cast
tile.c:1088: error: dereferencing pointer to incomplete type
tile.c:1088: error: dereferencing pointer to incomplete type
tile.c:1094: error: 'FALSE' undeclared (first use in this function)
tile.c:1095: warning: control reaches end of non-void function
tile.c: At top level:
tile.c:1099: error: expected declaration specifiers or '...' before 'CompAction'
tile.c:1100: error: expected declaration specifiers or '...' before 'CompActionState'
tile.c: In function 'tileToggle':
tile.c:1108: warning: assignment makes pointer from integer without a cast
tile.c:1114: error: dereferencing pointer to incomplete type
tile.c:1114: error: dereferencing pointer to incomplete type
tile.c:1116: error: dereferencing pointer to incomplete type
tile.c:1116: error: dereferencing pointer to incomplete type
tile.c:1118: error: dereferencing pointer to incomplete type
tile.c:1118: error: dereferencing pointer to incomplete type
tile.c:1118: error: dereferencing pointer to incomplete type
tile.c:1135: error: 'FALSE' undeclared (first use in this function)
tile.c:1136: warning: control reaches end of non-void function
tile.c: In function 'tileInitDisplay':
tile.c:1147: warning: implicit declaration of function 'allocateScreenPrivateIndex'
tile.c:1147: warning: nested extern declaration of 'allocateScreenPrivateIndex'
tile.c:1153: error: 'FALSE' undeclared (first use in this function)
tile.c:1156: error: too many arguments to function 'tileSetTileVerticallyInitiate'
tile.c:1157: error: too many arguments to function 'tileSetTileHorizontallyInitiate'
tile.c:1158: error: too many arguments to function 'tileSetTileTileInitiate'
tile.c:1159: error: too many arguments to function 'tileSetTileCascadeInitiate'
tile.c:1160: error: too many arguments to function 'tileSetTileRestoreInitiate'
tile.c:1161: error: too many arguments to function 'tileSetTileToggleInitiate'
tile.c:1164: error: dereferencing pointer to incomplete type
tile.c:1166: error: 'TRUE' undeclared (first use in this function)
tile.c:1167: warning: control reaches end of non-void function
tile.c: In function 'tileFiniDisplay':
tile.c:1173: error: dereferencing pointer to incomplete type
tile.c:1176: warning: implicit declaration of function 'freeScreenPrivateIndex'
tile.c:1176: warning: nested extern declaration of 'freeScreenPrivateIndex'
tile.c: In function 'tileInitWindow':
tile.c:1187: error: dereferencing pointer to incomplete type
tile.c:1187: error: dereferencing pointer to incomplete type
tile.c:1191: error: 'FALSE' undeclared (first use in this function)
tile.c:1204: error: 'TileWindow' has no member named 'outlineColor'
tile.c:1205: error: 'TileWindow' has no member named 'outlineColor'
tile.c:1206: error: 'TileWindow' has no member named 'outlineColor'
tile.c:1208: error: dereferencing pointer to incomplete type
tile.c:1210: error: 'TRUE' undeclared (first use in this function)
tile.c:1211: warning: control reaches end of non-void function
tile.c: In function 'tileFiniWindow':
tile.c:1217: error: dereferencing pointer to incomplete type
tile.c:1217: error: dereferencing pointer to incomplete type
tile.c:1217: error: dereferencing pointer to incomplete type
tile.c: In function 'tileInit':
tile.c:1225: warning: implicit declaration of function 'allocateDisplayPrivateIndex'
tile.c:1225: warning: nested extern declaration of 'allocateDisplayPrivateIndex'
tile.c:1228: error: 'FALSE' undeclared (first use in this function)
tile.c:1230: error: 'TRUE' undeclared (first use in this function)
tile.c:1231: warning: control reaches end of non-void function
tile.c: In function 'tileFini':
tile.c:1236: warning: implicit declaration of function 'freeDisplayPrivateIndex'
tile.c:1236: warning: nested extern declaration of 'freeDisplayPrivateIndex'
tile.c: In function 'tileGetVersion':
tile.c:1243: error: 'ABIVERSION' undeclared (first use in this function)
tile.c:1244: warning: control reaches end of non-void function
tile.c: At top level:
tile.c:1246: error: expected '=', ',', ';', 'asm' or '__attribute__' before 'tileVTable'
tile.c:1264: error: expected '=', ',', ';', 'asm' or '__attribute__' before '*' token
make: *** [build/tile.lo] Error 1
removing  : ./build
Operation successful, enjoy!!! TheeMahn
jerry@jerry-desktop:~/supercompiz$
Image

Image
User avatar
jfg69
Site Admin
 
Posts: 365
Joined: Mon Oct 15, 2007 2:15 pm
Location: Long Island, New York - USA
Age: 57
Operating System: Ultimate Edition 2.8 32 BIT



Re: Compiz Fusion - Super Compiz

Postby drama » Sun May 11, 2008 5:01 am

jfg69 wrote:LOL, Something has apparently gone wrong... oddly enough after all the errors, it says operation successful! Upon uninstalling to re-install, I apparently got rid of something that I needed. Just what that WAS I have no clue!
My CF only partially works.. when I use the compiz window mgr I dont have any bars on my windows. When I switch it to metacity, I get them, but then compiz does diddly-do. I also had to re-install NV drivers via Envy.
Good thing I have nothing better to do ;)




Code: Select all
tile.c:1095: warning: control reaches end of non-void function
tile.c: At top level:
tile.c:1099: error: expected declaration specifiers or '...' before 'CompAction'
tile.c:1100: error: expected declaration specifiers or '...' before 'CompActionState'
tile.c: In function 'tileToggle':
tile.c:1108: warning: assignment makes pointer from integer without a cast
tile.c:1114: error: dereferencing pointer to incomplete type
tile.c:1114: error: dereferencing pointer to incomplete type
tile.c:1116: error: dereferencing pointer to incomplete type
tile.c:1116: error: dereferencing pointer to incomplete type
tile.c:1118: error: dereferencing pointer to incomplete type
tile.c:1118: error: dereferencing pointer to incomplete type
tile.c:1118: error: dereferencing pointer to incomplete type
tile.c:1135: error: 'FALSE' undeclared (first use in this function)
tile.c:1136: warning: control reaches end of non-void function
tile.c: In function 'tileInitDisplay':
tile.c:1147: warning: implicit declaration of function 'allocateScreenPrivateIndex'
tile.c:1147: warning: nested extern declaration of 'allocateScreenPrivateIndex'
tile.c:1153: error: 'FALSE' undeclared (first use in this function)
tile.c:1156: error: too many arguments to function 'tileSetTileVerticallyInitiate'
tile.c:1157: error: too many arguments to function 'tileSetTileHorizontallyInitiate'
tile.c:1158: error: too many arguments to function 'tileSetTileTileInitiate'
tile.c:1159: error: too many arguments to function 'tileSetTileCascadeInitiate'
tile.c:1160: error: too many arguments to function 'tileSetTileRestoreInitiate'
tile.c:1161: error: too many arguments to function 'tileSetTileToggleInitiate'
tile.c:1164: error: dereferencing pointer to incomplete type
tile.c:1166: error: 'TRUE' undeclared (first use in this function)
tile.c:1167: warning: control reaches end of non-void function
tile.c: In function 'tileFiniDisplay':
tile.c:1173: error: dereferencing pointer to incomplete type
tile.c:1176: warning: implicit declaration of function 'freeScreenPrivateIndex'
tile.c:1176: warning: nested extern declaration of 'freeScreenPrivateIndex'
tile.c: In function 'tileInitWindow':
tile.c:1187: error: dereferencing pointer to incomplete type
tile.c:1187: error: dereferencing pointer to incomplete type
tile.c:1191: error: 'FALSE' undeclared (first use in this function)
tile.c:1204: error: 'TileWindow' has no member named 'outlineColor'
tile.c:1205: error: 'TileWindow' has no member named 'outlineColor'
tile.c:1206: error: 'TileWindow' has no member named 'outlineColor'
tile.c:1208: error: dereferencing pointer to incomplete type
tile.c:1210: error: 'TRUE' undeclared (first use in this function)
tile.c:1211: warning: control reaches end of non-void function
tile.c: In function 'tileFiniWindow':
tile.c:1217: error: dereferencing pointer to incomplete type
tile.c:1217: error: dereferencing pointer to incomplete type
tile.c:1217: error: dereferencing pointer to incomplete type
tile.c: In function 'tileInit':
tile.c:1225: warning: implicit declaration of function 'allocateDisplayPrivateIndex'
tile.c:1225: warning: nested extern declaration of 'allocateDisplayPrivateIndex'
tile.c:1228: error: 'FALSE' undeclared (first use in this function)
tile.c:1230: error: 'TRUE' undeclared (first use in this function)
tile.c:1231: warning: control reaches end of non-void function
tile.c: In function 'tileFini':
tile.c:1236: warning: implicit declaration of function 'freeDisplayPrivateIndex'
tile.c:1236: warning: nested extern declaration of 'freeDisplayPrivateIndex'
tile.c: In function 'tileGetVersion':
tile.c:1243: error: 'ABIVERSION' undeclared (first use in this function)
tile.c:1244: warning: control reaches end of non-void function
tile.c: At top level:
tile.c:1246: error: expected '=', ',', ';', 'asm' or '__attribute__' before 'tileVTable'
tile.c:1264: error: expected '=', ',', ';', 'asm' or '__attribute__' before '*' token
make: *** [build/tile.lo] Error 1
compiling : tile.c -> build/tile.loIn file included from tile.c:38:
build/tile_options.h:19: error: expected '=', ',', ';', 'asm' or '__attribute__' before '*' token
build/tile_options.h:95: error: expected '=', ',', ';', 'asm' or '__attribute__' before '*' token
build/tile_options.h:99: error: expected '=', ',', ';', 'asm' or '__attribute__' before '*' token
build/tile_options.h:100: error: expected declaration specifiers or '...' before 'CompActionCallBackProc'
build/tile_options.h:101: error: expected declaration specifiers or '...' before 'CompActionCallBackProc'
build/tile_options.h:105: error: expected '=', ',', ';', 'asm' or '__attribute__' before '*' token
build/tile_options.h:106: error: expected declaration specifiers or '...' before 'CompActionCallBackProc'
build/tile_options.h:107: error: expected declaration specifiers or '...' before 'CompActionCallBackProc'
build/tile_options.h:111: error: expected '=', ',', ';', 'asm' or '__attribute__' before '*' token
build/tile_options.h:112: error: expected declaration specifiers or '...' before 'CompActionCallBackProc'
build/tile_options.h:113: error: expected declaration specifiers or '...' before 'CompActionCallBackProc'
build/tile_options.h:117: error: expected '=', ',', ';', 'asm' or '__attribute__' before '*' token
build/tile_options.h:118: error: expected declaration specifiers or '...' before 'CompActionCallBackProc'
build/tile_options.h:119: error: expected declaration specifiers or '...' before 'CompActionCallBackProc'
build/tile_options.h:123: error: expected '=', ',', ';', 'asm' or '__attribute__' before '*' token
build/tile_options.h:124: error: expected declaration specifiers or '...' before 'CompActionCallBackProc'
build/tile_options.h:125: error: expected declaration specifiers or '...' before 'CompActionCallBackProc'
build/tile_options.h:129: error: expected '=', ',', ';', 'asm' or '__attribute__' before '*' token
build/tile_options.h:130: error: expected declaration specifiers or '...' before 'CompActionCallBackProc'
build/tile_options.h:131: error: expected declaration specifiers or '...' before 'CompActionCallBackProc'
tile.c:61: error: expected specifier-qualifier-list before 'PaintWindowProc'
tile.c:84: error: expected specifier-qualifier-list before 'GLushort'
tile.c:110: warning: type defaults to 'int' in declaration of 'WindowPaintAttrib'
tile.c:110: error: expected ';', ',' or ')' before '*' token
tile.c: In function 'tilePreparePaintScreen':
tile.c:242: error: dereferencing pointer to incomplete type
tile.c:242: error: dereferencing pointer to incomplete type
tile.c:248: warning: implicit declaration of function 'UNWRAP'
tile.c:248: warning: nested extern declaration of 'UNWRAP'
tile.c:248: error: 'preparePaintScreen' undeclared (first use in this function)
tile.c:248: error: (Each undeclared identifier is reported only once
tile.c:248: error: for each function it appears in.)
tile.c:249: error: dereferencing pointer to incomplete type
tile.c:250: warning: implicit declaration of function 'WRAP'
tile.c:250: warning: nested extern declaration of 'WRAP'
tile.c: At top level:
tile.c:255: error: expected declaration specifiers or '...' before 'CompOutput'
tile.c: In function 'tilePaintScreen':
tile.c:259: error: dereferencing pointer to incomplete type
tile.c:259: error: dereferencing pointer to incomplete type
tile.c:263: error: 'outputs' undeclared (first use in this function)
tile.c:263: error: dereferencing pointer to incomplete type
tile.c:267: error: 'paintScreen' undeclared (first use in this function)
tile.c:268: error: dereferencing pointer to incomplete type
tile.c: In function 'tileDonePaintScreen':
tile.c:275: error: dereferencing pointer to incomplete type
tile.c:275: error: dereferencing pointer to incomplete type
tile.c:279: error: dereferencing pointer to incomplete type
tile.c:282: error: dereferencing pointer to incomplete type
tile.c:282: error: dereferencing pointer to incomplete type
tile.c:284: error: dereferencing pointer to incomplete type
tile.c:284: error: dereferencing pointer to incomplete type
tile.c:284: error: dereferencing pointer to incomplete type
tile.c:290: warning: implicit declaration of function 'removeScreenGrab'
tile.c:290: warning: nested extern declaration of 'removeScreenGrab'
tile.c:294: warning: implicit declaration of function 'damageScreen'
tile.c:294: warning: nested extern declaration of 'damageScreen'
tile.c:297: error: 'donePaintScreen' undeclared (first use in this function)
tile.c:298: error: dereferencing pointer to incomplete type
tile.c: At top level:
tile.c:304: warning: type defaults to 'int' in declaration of 'ScreenPaintAttrib'
tile.c:304: error: expected ';', ',' or ')' before '*' token
tile.c: In function 'tileResizeNotify':
tile.c:396: error: dereferencing pointer to incomplete type
tile.c:396: error: dereferencing pointer to incomplete type
tile.c:397: error: dereferencing pointer to incomplete type
tile.c:397: error: dereferencing pointer to incomplete type
tile.c:397: error: dereferencing pointer to incomplete type
tile.c:399: error: dereferencing pointer to incomplete type
tile.c:399: error: 'windowResizeNotify' undeclared (first use in this function)
tile.c:400: error: dereferencing pointer to incomplete type
tile.c:401: error: dereferencing pointer to incomplete type
tile.c:405: error: 'TRUE' undeclared (first use in this function)
tile.c:410: error: dereferencing pointer to incomplete type
tile.c:413: error: 'FALSE' undeclared (first use in this function)
tile.c:416: error: dereferencing pointer to incomplete type
tile.c:416: error: dereferencing pointer to incomplete type
tile.c:437: error: dereferencing pointer to incomplete type
tile.c:437: error: dereferencing pointer to incomplete type
tile.c:438: error: dereferencing pointer to incomplete type
tile.c:438: error: dereferencing pointer to incomplete type
tile.c:439: error: dereferencing pointer to incomplete type
tile.c:439: error: dereferencing pointer to incomplete type
tile.c:440: error: dereferencing pointer to incomplete type
tile.c:445: error: dereferencing pointer to incomplete type
tile.c:445: error: dereferencing pointer to incomplete type
tile.c:446: error: dereferencing pointer to incomplete type
tile.c:446: error: dereferencing pointer to incomplete type
tile.c:447: error: dereferencing pointer to incomplete type
tile.c:448: error: dereferencing pointer to incomplete type
tile.c:448: error: dereferencing pointer to incomplete type
tile.c:449: error: dereferencing pointer to incomplete type
tile.c:456: error: dereferencing pointer to incomplete type
tile.c:456: error: dereferencing pointer to incomplete type
tile.c:457: error: dereferencing pointer to incomplete type
tile.c:458: error: dereferencing pointer to incomplete type
tile.c:458: error: dereferencing pointer to incomplete type
tile.c:459: error: dereferencing pointer to incomplete type
tile.c:459: error: dereferencing pointer to incomplete type
tile.c:464: error: dereferencing pointer to incomplete type
tile.c:464: error: dereferencing pointer to incomplete type
tile.c:465: error: dereferencing pointer to incomplete type
tile.c:465: error: dereferencing pointer to incomplete type
tile.c:466: error: dereferencing pointer to incomplete type
tile.c:467: error: dereferencing pointer to incomplete type
tile.c:468: error: dereferencing pointer to incomplete type
tile.c:468: error: dereferencing pointer to incomplete type
tile.c:477: error: dereferencing pointer to incomplete type
tile.c:479: error: dereferencing pointer to incomplete type
tile.c:479: error: dereferencing pointer to incomplete type
tile.c:481: error: dereferencing pointer to incomplete type
tile.c:481: error: dereferencing pointer to incomplete type
tile.c:481: error: dereferencing pointer to incomplete type
tile.c:483: error: dereferencing pointer to incomplete type
tile.c:483: error: dereferencing pointer to incomplete type
tile.c:486: error: dereferencing pointer to incomplete type
tile.c:487: error: dereferencing pointer to incomplete type
tile.c:487: error: dereferencing pointer to incomplete type
tile.c:487: error: dereferencing pointer to incomplete type
tile.c:489: error: dereferencing pointer to incomplete type
tile.c:490: error: dereferencing pointer to incomplete type
tile.c:491: error: dereferencing pointer to incomplete type
tile.c:499: error: dereferencing pointer to incomplete type
tile.c:501: error: dereferencing pointer to incomplete type
tile.c:501: error: dereferencing pointer to incomplete type
tile.c:503: error: dereferencing pointer to incomplete type
tile.c:503: error: dereferencing pointer to incomplete type
tile.c:503: error: dereferencing pointer to incomplete type
tile.c:505: error: dereferencing pointer to incomplete type
tile.c:505: error: dereferencing pointer to incomplete type
tile.c:511: error: dereferencing pointer to incomplete type
tile.c:511: error: dereferencing pointer to incomplete type
tile.c:512: error: dereferencing pointer to incomplete type
tile.c:512: error: dereferencing pointer to incomplete type
tile.c:513: error: dereferencing pointer to incomplete type
tile.c:513: error: dereferencing pointer to incomplete type
tile.c:514: error: dereferencing pointer to incomplete type
tile.c:520: error: dereferencing pointer to incomplete type
tile.c:521: error: dereferencing pointer to incomplete type
tile.c:522: error: dereferencing pointer to incomplete type
tile.c:523: error: dereferencing pointer to incomplete type
tile.c:525: error: dereferencing pointer to incomplete type
tile.c:525: error: dereferencing pointer to incomplete type
tile.c:526: error: dereferencing pointer to incomplete type
tile.c:526: error: dereferencing pointer to incomplete type
tile.c:527: error: dereferencing pointer to incomplete type
tile.c:527: error: dereferencing pointer to incomplete type
tile.c:528: error: dereferencing pointer to incomplete type
tile.c:528: error: dereferencing pointer to incomplete type
tile.c:529: error: dereferencing pointer to incomplete type
tile.c:529: error: dereferencing pointer to incomplete type
tile.c:530: error: dereferencing pointer to incomplete type
tile.c:530: error: dereferencing pointer to incomplete type
tile.c:532: error: dereferencing pointer to incomplete type
tile.c:534: error: dereferencing pointer to incomplete type
tile.c:534: error: dereferencing pointer to incomplete type
tile.c: In function 'tileInitScreen':
tile.c:554: error: dereferencing pointer to incomplete type
tile.c:558: warning: implicit declaration of function 'allocateWindowPrivateIndex'
tile.c:558: warning: nested extern declaration of 'allocateWindowPrivateIndex'
tile.c:562: error: 'FALSE' undeclared (first use in this function)
tile.c:566: error: dereferencing pointer to incomplete type
tile.c:573: error: 'paintOutput' undeclared (first use in this function)
tile.c:573: error: 'tilePaintOutput' undeclared (first use in this function)
tile.c:574: error: 'preparePaintScreen' undeclared (first use in this function)
tile.c:575: error: 'paintScreen' undeclared (first use in this function)
tile.c:576: error: 'donePaintScreen' undeclared (first use in this function)
tile.c:577: error: 'windowResizeNotify' undeclared (first use in this function)
tile.c:578: error: 'paintWindow' undeclared (first use in this function)
tile.c:578: error: 'tilePaintWindow' undeclared (first use in this function)
tile.c:580: error: 'TRUE' undeclared (first use in this function)
tile.c:581: warning: control reaches end of non-void function
tile.c: In function 'tileFiniScreen':
tile.c:587: error: dereferencing pointer to incomplete type
tile.c:587: error: dereferencing pointer to incomplete type
tile.c:589: warning: implicit declaration of function 'freeWindowPrivateIndex'
tile.c:589: warning: nested extern declaration of 'freeWindowPrivateIndex'
tile.c:592: error: 'paintOutput' undeclared (first use in this function)
tile.c:593: error: 'preparePaintScreen' undeclared (first use in this function)
tile.c:594: error: 'paintScreen' undeclared (first use in this function)
tile.c:595: error: 'donePaintScreen' undeclared (first use in this function)
tile.c:596: error: 'windowResizeNotify' undeclared (first use in this function)
tile.c:597: error: 'paintWindow' undeclared (first use in this function)
tile.c: In function 'constrainMinMax':
tile.c:611: error: dereferencing pointer to incomplete type
tile.c:614: error: 'MAXSHORT' undeclared (first use in this function)
tile.c: In function 'placeWin':
tile.c:661: error: 'FALSE' undeclared (first use in this function)
tile.c:668: error: dereferencing pointer to incomplete type
tile.c:668: error: dereferencing pointer to incomplete type
tile.c:669: error: dereferencing pointer to incomplete type
tile.c:669: error: dereferencing pointer to incomplete type
tile.c:670: error: 'TRUE' undeclared (first use in this function)
tile.c:672: error: dereferencing pointer to incomplete type
tile.c:672: error: dereferencing pointer to incomplete type
tile.c:672: error: dereferencing pointer to incomplete type
tile.c:675: error: dereferencing pointer to incomplete type
tile.c:676: error: dereferencing pointer to incomplete type
tile.c:677: error: dereferencing pointer to incomplete type
tile.c:678: error: dereferencing pointer to incomplete type
tile.c:689: error: dereferencing pointer to incomplete type
tile.c:708: warning: control reaches end of non-void function
tile.c: In function 'tileSetNewWindowSize':
tile.c:715: error: dereferencing pointer to incomplete type
tile.c:715: error: dereferencing pointer to incomplete type
tile.c:715: error: dereferencing pointer to incomplete type
tile.c:716: error: dereferencing pointer to incomplete type
tile.c:716: error: dereferencing pointer to incomplete type
tile.c:726: warning: implicit declaration of function 'maximizeWindow'
tile.c:726: warning: nested extern declaration of 'maximizeWindow'
tile.c:731: warning: implicit declaration of function 'configureXWindow'
tile.c:731: warning: nested extern declaration of 'configureXWindow'
tile.c:732: error: 'FALSE' undeclared (first use in this function)
tile.c:734: error: 'TRUE' undeclared (first use in this function)
tile.c:735: warning: control reaches end of non-void function
tile.c: In function 'isTileWindow':
tile.c:742: warning: implicit declaration of function 'matchEval'
tile.c:742: warning: nested extern declaration of 'matchEval'
tile.c:742: warning: implicit declaration of function 'tileGetExcludeMatch'
tile.c:742: warning: nested extern declaration of 'tileGetExcludeMatch'
tile.c:742: error: dereferencing pointer to incomplete type
tile.c:743: error: 'FALSE' undeclared (first use in this function)
tile.c:745: error: dereferencing pointer to incomplete type
tile.c:748: error: dereferencing pointer to incomplete type
tile.c:751: error: dereferencing pointer to incomplete type
tile.c:751: error: 'CompWindowTypeDockMask' undeclared (first use in this function)
tile.c:751: error: 'CompWindowTypeDesktopMask' undeclared (first use in this function)
tile.c:754: error: dereferencing pointer to incomplete type
tile.c:754: error: 'CompWindowStateSkipPagerMask' undeclared (first use in this function)
tile.c:757: error: dereferencing pointer to incomplete type
tile.c:757: error: dereferencing pointer to incomplete type
tile.c:760: error: 'TRUE' undeclared (first use in this function)
tile.c:761: warning: control reaches end of non-void function
tile.c: In function 'saveCoords':
tile.c:767: error: dereferencing pointer to incomplete type
tile.c:767: error: dereferencing pointer to incomplete type
tile.c:767: error: dereferencing pointer to incomplete type
tile.c:772: error: dereferencing pointer to incomplete type
tile.c:773: error: dereferencing pointer to incomplete type
tile.c:774: error: dereferencing pointer to incomplete type
tile.c:775: error: dereferencing pointer to incomplete type
tile.c:777: error: dereferencing pointer to incomplete type
tile.c:777: error: 'MAXIMIZE_STATE' undeclared (first use in this function)
tile.c:779: error: 'TRUE' undeclared (first use in this function)
tile.c: In function 'applyTiling':
tile.c:789: error: dereferencing pointer to incomplete type
tile.c:789: error: dereferencing pointer to incomplete type
tile.c:792: error: 'FALSE' undeclared (first use in this function)
tile.c:794: error: dereferencing pointer to incomplete type
tile.c:794: error: dereferencing pointer to incomplete type
tile.c:800: error: dereferencing pointer to incomplete type
tile.c:800: warning: implicit declaration of function 'MAX'
tile.c:800: warning: nested extern declaration of 'MAX'
tile.c:809: error: 'TRUE' undeclared (first use in this function)
tile.c:812: error: 'CompWindowExtents' undeclared (first use in this function)
tile.c:812: error: expected ';' before 'border'
tile.c:814: error: 'border' undeclared (first use in this function)
tile.c:819: error: dereferencing pointer to incomplete type
tile.c:819: error: dereferencing pointer to incomplete type
tile.c:821: error: dereferencing pointer to incomplete type
tile.c:822: error: dereferencing pointer to incomplete type
tile.c:823: error: dereferencing pointer to incomplete type
tile.c:824: error: dereferencing pointer to incomplete type
tile.c:825: error: dereferencing pointer to incomplete type
tile.c:826: error: dereferencing pointer to incomplete type
tile.c:827: error: dereferencing pointer to incomplete type
tile.c:828: error: dereferencing pointer to incomplete type
tile.c:831: error: dereferencing pointer to incomplete type
tile.c:845: error: dereferencing pointer to incomplete type
tile.c:858: error: dereferencing pointer to incomplete type
tile.c:868: error: dereferencing pointer to incomplete type
tile.c:868: error: dereferencing pointer to incomplete type
tile.c:873: error: dereferencing pointer to incomplete type
tile.c:873: error: dereferencing pointer to incomplete type
tile.c:873: error: dereferencing pointer to incomplete type
tile.c:969: warning: implicit declaration of function 'pushScreenGrab'
tile.c:969: warning: nested extern declaration of 'pushScreenGrab'
tile.c:969: error: dereferencing pointer to incomplete type
tile.c:975: warning: control reaches end of non-void function
tile.c: At top level:
tile.c:979: error: expected declaration specifiers or '...' before 'CompAction'
tile.c:980: error: expected declaration specifiers or '...' before 'CompActionState'
tile.c: In function 'tileTile':
tile.c:987: warning: implicit declaration of function 'getIntOptionNamed'
tile.c:987: warning: nested extern declaration of 'getIntOptionNamed'
tile.c:988: warning: implicit declaration of function 'findScreenAtDisplay'
tile.c:988: warning: nested extern declaration of 'findScreenAtDisplay'
tile.c:988: warning: assignment makes pointer from integer without a cast
tile.c:992: error: dereferencing pointer to incomplete type
tile.c:992: error: dereferencing pointer to incomplete type
tile.c:998: error: 'FALSE' undeclared (first use in this function)
tile.c:999: warning: control reaches end of non-void function
tile.c: At top level:
tile.c:1003: error: expected declaration specifiers or '...' before 'CompAction'
tile.c:1004: error: expected declaration specifiers or '...' before 'CompActionState'
tile.c: In function 'tileVertically':
tile.c:1012: warning: assignment makes pointer from integer without a cast
tile.c:1016: error: dereferencing pointer to incomplete type
tile.c:1016: error: dereferencing pointer to incomplete type
tile.c:1022: error: 'FALSE' undeclared (first use in this function)
tile.c:1023: warning: control reaches end of non-void function
tile.c: At top level:
tile.c:1027: error: expected declaration specifiers or '...' before 'CompAction'
tile.c:1028: error: expected declaration specifiers or '...' before 'CompActionState'
tile.c: In function 'tileHorizontally':
tile.c:1036: warning: assignment makes pointer from integer without a cast
tile.c:1040: error: dereferencing pointer to incomplete type
tile.c:1040: error: dereferencing pointer to incomplete type
tile.c:1046: error: 'FALSE' undeclared (first use in this function)
tile.c:1047: warning: control reaches end of non-void function
tile.c: At top level:
tile.c:1051: error: expected declaration specifiers or '...' before 'CompAction'
tile.c:1052: error: expected declaration specifiers or '...' before 'CompActionState'
tile.c: In function 'tileCascade':
tile.c:1060: warning: assignment makes pointer from integer without a cast
tile.c:1064: error: dereferencing pointer to incomplete type
tile.c:1064: error: dereferencing pointer to incomplete type
tile.c:1070: error: 'FALSE' undeclared (first use in this function)
tile.c:1071: warning: control reaches end of non-void function
tile.c: At top level:
tile.c:1075: error: expected declaration specifiers or '...' before 'CompAction'
tile.c:1076: error: expected declaration specifiers or '...' before 'CompActionState'
tile.c: In function 'tileRestore':
tile.c:1084: warning: assignment makes pointer from integer without a cast
tile.c:1088: error: dereferencing pointer to incomplete type
tile.c:1088: error: dereferencing pointer to incomplete type
tile.c:1094: error: 'FALSE' undeclared (first use in this function)
tile.c:1095: warning: control reaches end of non-void function
tile.c: At top level:
tile.c:1099: error: expected declaration specifiers or '...' before 'CompAction'
tile.c:1100: error: expected declaration specifiers or '...' before 'CompActionState'
tile.c: In function 'tileToggle':
tile.c:1108: warning: assignment makes pointer from integer without a cast
tile.c:1114: error: dereferencing pointer to incomplete type
tile.c:1114: error: dereferencing pointer to incomplete type
tile.c:1116: error: dereferencing pointer to incomplete type
tile.c:1116: error: dereferencing pointer to incomplete type
tile.c:1118: error: dereferencing pointer to incomplete type
tile.c:1118: error: dereferencing pointer to incomplete type
tile.c:1118: error: dereferencing pointer to incomplete type
tile.c:1135: error: 'FALSE' undeclared (first use in this function)
tile.c:1136: warning: control reaches end of non-void function
tile.c: In function 'tileInitDisplay':
tile.c:1147: warning: implicit declaration of function 'allocateScreenPrivateIndex'
tile.c:1147: warning: nested extern declaration of 'allocateScreenPrivateIndex'
tile.c:1153: error: 'FALSE' undeclared (first use in this function)
tile.c:1156: error: too many arguments to function 'tileSetTileVerticallyInitiate'
tile.c:1157: error: too many arguments to function 'tileSetTileHorizontallyInitiate'
tile.c:1158: error: too many arguments to function 'tileSetTileTileInitiate'
tile.c:1159: error: too many arguments to function 'tileSetTileCascadeInitiate'
tile.c:1160: error: too many arguments to function 'tileSetTileRestoreInitiate'
tile.c:1161: error: too many arguments to function 'tileSetTileToggleInitiate'
tile.c:1164: error: dereferencing pointer to incomplete type
tile.c:1166: error: 'TRUE' undeclared (first use in this function)
tile.c:1167: warning: control reaches end of non-void function
tile.c: In function 'tileFiniDisplay':
tile.c:1173: error: dereferencing pointer to incomplete type
tile.c:1176: warning: implicit declaration of function 'freeScreenPrivateIndex'
tile.c:1176: warning: nested extern declaration of 'freeScreenPrivateIndex'
tile.c: In function 'tileInitWindow':
tile.c:1187: error: dereferencing pointer to incomplete type
tile.c:1187: error: dereferencing pointer to incomplete type
tile.c:1191: error: 'FALSE' undeclared (first use in this function)
tile.c:1204: error: 'TileWindow' has no member named 'outlineColor'
tile.c:1205: error: 'TileWindow' has no member named 'outlineColor'
tile.c:1206: error: 'TileWindow' has no member named 'outlineColor'
tile.c:1208: error: dereferencing pointer to incomplete type
tile.c:1210: error: 'TRUE' undeclared (first use in this function)
tile.c:1211: warning: control reaches end of non-void function
tile.c: In function 'tileFiniWindow':
tile.c:1217: error: dereferencing pointer to incomplete type
tile.c:1217: error: dereferencing pointer to incomplete type
tile.c:1217: error: dereferencing pointer to incomplete type
tile.c: In function 'tileInit':
tile.c:1225: warning: implicit declaration of function 'allocateDisplayPrivateIndex'
tile.c:1225: warning: nested extern declaration of 'allocateDisplayPrivateIndex'
tile.c:1228: error: 'FALSE' undeclared (first use in this function)
tile.c:1230: error: 'TRUE' undeclared (first use in this function)
tile.c:1231: warning: control reaches end of non-void function
tile.c: In function 'tileFini':
tile.c:1236: warning: implicit declaration of function 'freeDisplayPrivateIndex'
tile.c:1236: warning: nested extern declaration of 'freeDisplayPrivateIndex'
tile.c: In function 'tileGetVersion':
tile.c:1243: error: 'ABIVERSION' undeclared (first use in this function)
tile.c:1244: warning: control reaches end of non-void function
tile.c: At top level:
tile.c:1246: error: expected '=', ',', ';', 'asm' or '__attribute__' before 'tileVTable'
tile.c:1264: error: expected '=', ',', ';', 'asm' or '__attribute__' before '*' token
make: *** [build/tile.lo] Error 1
removing  : ./build
Operation successful, enjoy!!! TheeMahn
jerry@jerry-desktop:~/supercompiz$


perhaps its a problem with the "compiz-gtk" package.

do you have this package installed?

when you uninstalled how did you do it?

usually i tried it i had remove everything that came up in a search for compiz as well as a search for emerald. i also had to choose the "complete removal" option.

also could you post the contents of the following file

/usr/bin/compiz


there may just be something missing from it.
ULTIMATE EDITION 2.5 X64/ARCHLINUX X64 DUAL BOOT
Antec 900two case
3 antec 120mm tri cool blue led fans (1 rear exaust 2 front intake)
1 antec 220mm "bigboy" tri cool blue led fan (top exaust)
Amd Phenom II X4 955 Black Edition Am3 Cpu OC'D @ 4.2 Rev C3
MSI NF980-G65 Am3 Socket DDR3 Tri-sli ATX Mainboard
Nvidia 980A Sli Chipset
Corsair 2GB Dual Channel ram (1GBx2) DDR3 @ 1600 MHZ
EVGA Nvidia GTS-250 1GB PCI Express Graphics Card
Lite-On Dual Layer Sata Dvd Burner
3x 1TB Seagate Sata Hdd's 32Mb cache
ASUS VH235 23 Inch Lcd Wide Screen Monitor
OCZ ModXStream Pro 700Watt Psu
Rosewill 3.5" Internal USB 2.0 Card Reader w/ Floppy Drive
User avatar
drama
U.E. Master
U.E. Master
 
Posts: 580
Joined: Wed Oct 17, 2007 11:26 am
Location: eastern iowa, united states
Age: 37
Operating System: Ultimate Edition 3.2 32 BIT

PreviousNext

Return to Compiz Fusion and Beryl

Who is online

Users browsing this forum: No registered users and 1 guest

cron